Target
Integrin alpha-IIb/beta-3
Ligand
BDBM50030032
Substrate
Meas. Tech.
ChEMBL_217152 (CHEMBL824581)
IC50
38±n/a nM
Citation
 Cheng, SCraig, WSMullen, DTschopp, JFDixon, DPierschbacher, MD Design and synthesis of novel cyclic RGD-containing peptides as highly potent and selective integrin alpha IIb beta 3 antagonists. J Med Chem 37:1-8 (1994)  
Target
Name:
Integrin alpha-IIb/beta-3
Synonyms:
Glycoprotein IIb/IIIa
Type:
Mol. Mass.:
Description:
ASSAY_ID of EBI is 30109
Components:
This complex has 2 components.
Component 1
Name:
Integrin beta-3
Synonyms:
CD_antigen=CD61 GPIIIa ITGB3 Platelet membrane glycoprotein IIIa
Type:
Protein
Mol. Mass.:
87038.91
Organism:
Homo sapiens (Human)
Description:
P05106
Residue:
788
  
Component 2
Name:
Integrin alpha-IIb
Synonyms:
CD_antigen=CD41 GPIIb Glycoprotein IIb ITGA2B Integrin alpha-IIb heavy chain Integrin alpha-IIb light chain, form 2 Integrin alpha-V/beta-3 and alpha-IIb/beta 3 | Platelet membrane glycoprotein IIb
Type:
Protein
Mol. Mass.:
113354.85
Organism:
Homo sapiens (Human)
Description:
P08514
Residue:
1039
  
Inhibitor
Name:
BDBM50030032
Synonyms:
Ac-C-N-P-R-G-D-(Y-OMe)-K-C-NH2 | CHEMBL267950
Type:
Small organic molecule
Emp. Form.:
C45H69N15O14S2
Mol. Mass.:
1108.251
SMILES:
COc1ccc(C[C@@H]2NC(=O)[C@@H](CC(O)=O)NC(=O)CNC(=O)[C@@H](CCCNC(N)=N)NC(=O)[C@@H]3CCCN3C(=O)[C@@H](CC(N)=O)NC(=O)[C@@H](CSSC[C@@H](NC(=O)[C@@H](CCCCN)NC2=O)C(N)=O)NC(C)=O)cc1
: