Target
Integrin alpha-5/beta-1
Ligand
BDBM50030032
Substrate
Meas. Tech.
ChEMBL_217623 (CHEMBL820366)
IC50
1560±n/a nM
Citation
 Cheng, SCraig, WSMullen, DTschopp, JFDixon, DPierschbacher, MD Design and synthesis of novel cyclic RGD-containing peptides as highly potent and selective integrin alpha IIb beta 3 antagonists. J Med Chem 37:1-8 (1994)  
Target
Name:
Integrin alpha-5/beta-1
Synonyms:
Fibronectin receptor alpha/beta ITGA5/ITGB1
Type:
Enzyme
Mol. Mass.:
Description:
Components:
This complex has 2 components.
Component 1
Name:
Integrin alpha-5
Synonyms:
CD49 antigen-like family member E FNRA Fibronectin receptor subunit alpha ITGA5 Integrin alpha-F | VLA-5
Type:
Single-pass type I membrane protein
Mol. Mass.:
114523.00
Organism:
Homo sapiens (Human)
Description:
Residue:
1049
  
Component 2
Name:
Integrin beta-1
Synonyms:
CD_antigen=CD29 Fibronectin receptor beta GPIIA ITGB1 MDF2 | MSK12
Type:
Enzyme
Mol. Mass.:
88400.38
Organism:
Homo sapiens (Human)
Description:
P05556
Residue:
798
  
Inhibitor
Name:
BDBM50030032
Synonyms:
Ac-C-N-P-R-G-D-(Y-OMe)-K-C-NH2 | CHEMBL267950
Type:
Small organic molecule
Emp. Form.:
C45H69N15O14S2
Mol. Mass.:
1108.251
SMILES:
COc1ccc(C[C@@H]2NC(=O)[C@@H](CC(O)=O)NC(=O)CNC(=O)[C@@H](CCCNC(N)=N)NC(=O)[C@@H]3CCCN3C(=O)[C@@H](CC(N)=O)NC(=O)[C@@H](CSSC[C@@H](NC(=O)[C@@H](CCCCN)NC2=O)C(N)=O)NC(C)=O)cc1
: