Target
Protoporphyrinogen oxidase
Ligand
BDBM50486212
Substrate
Meas. Tech.
ChEMBL_908776 (CHEMBL3066844)
Ki
724±n/a nM
Citation
 Zhang, LTan, YWang, NXWu, QYXi, ZYang, GF Design, syntheses and 3D-QSAR studies of novel N-phenyl pyrrolidin-2-ones and N-phenyl-1H-pyrrol-2-ones as protoporphyrinogen oxidase inhibitors. Bioorg Med Chem 18:7948-56 (2010)  
Target
Name:
Protoporphyrinogen oxidase
Synonyms:
PPO PPOX_HUMAN
Type:
PROTEIN
Mol. Mass.:
50774.78
Organism:
Homo sapiens (Human)
Description:
ChEMBL_791250
Residue:
477
  
Inhibitor
Name:
BDBM50486212
Synonyms:
CHEBI:9339 | SULFENTRAZONE
Type:
Small organic molecule
Emp. Form.:
C11H10Cl2F2N4O3S
Mol. Mass.:
387.19
SMILES:
Cc1nn(-c2cc(NS(C)(=O)=O)c(Cl)cc2Cl)c(=O)n1C(F)F
: