Target
Reverse transcriptase/RNaseH
Ligand
BDBM50030549
Substrate
Meas. Tech.
ChEMBL_195358 (CHEMBL802598)
IC50
14700±n/a nM
Citation
 Maruenda, HJohnson, F Design and synthesis of novel inhibitors of HIV-1 reverse transcriptase. J Med Chem 38:2145-51 (1995)  
Target
Name:
Reverse transcriptase/RNaseH
Synonyms:
HIV-1 Reverse Transcriptase RNase H Reverse transcriptase/RNaseH
Type:
PROTEIN
Mol. Mass.:
65229.15
Organism:
Human immunodeficiency virus 1
Description:
ChEMBL_1473730
Residue:
566
  
Inhibitor
Name:
BDBM50030549
Synonyms:
Acetic acid 2-(10-methyl-1,3-dioxo-2,3,10,11-tetrahydro-1H-5-thia-2,4,10-triaza-dibenzo[a,d]cyclohepten-4-ylmethoxy)-ethyl ester | CHEMBL67095
Type:
Small organic molecule
Emp. Form.:
C17H19N3O5S
Mol. Mass.:
377.415
SMILES:
CN1Cc2c(Sc3ccccc13)n(COCCOC(C)=O)c(=O)[nH]c2=O
: