Target
Uridine phosphorylase 1
Ligand
BDBM50030981
Substrate
Meas. Tech.
ChEMBL_212951 (CHEMBL873996)
IC50
350±n/a nM
Citation
 Orr, GFMusso, DLBoswell, GEKelley, JLJoyner, SSDavis, STBaccanari, DP Inhibition of uridine phosphorylase: synthesis and structure-activity relationships of aryl-substituted 5-benzyluracils and 1-[(2-hydroxyethoxy)methyl]-5-benzyluracils. J Med Chem 38:3850-6 (1995)  
Target
Name:
Uridine phosphorylase 1
Synonyms:
UPP1_MOUSE Upp | Upp1
Type:
PROTEIN
Mol. Mass.:
34086.29
Organism:
Mus musculus
Description:
ChEMBL_212951
Residue:
311
  
Inhibitor
Name:
BDBM50030981
Synonyms:
5-(3,5-Difluoro-benzyl)-1-(2-hydroxy-ethoxymethyl)-1H-pyrimidine-2,4-dione | CHEMBL340623
Type:
Small organic molecule
Emp. Form.:
C14H14F2N2O4
Mol. Mass.:
312.2688
SMILES:
OCCOCn1cc(Cc2cc(F)cc(F)c2)c(=O)[nH]c1=O
: