Target
Uridine phosphorylase 1
Ligand
BDBM50030990
Substrate
Meas. Tech.
ChEMBL_212951 (CHEMBL873996)
IC50
68.0±n/a nM
Citation
 Orr, GFMusso, DLBoswell, GEKelley, JLJoyner, SSDavis, STBaccanari, DP Inhibition of uridine phosphorylase: synthesis and structure-activity relationships of aryl-substituted 5-benzyluracils and 1-[(2-hydroxyethoxy)methyl]-5-benzyluracils. J Med Chem 38:3850-6 (1995)  
Target
Name:
Uridine phosphorylase 1
Synonyms:
UPP1_MOUSE Upp | Upp1
Type:
PROTEIN
Mol. Mass.:
34086.29
Organism:
Mus musculus
Description:
ChEMBL_212951
Residue:
311
  
Inhibitor
Name:
BDBM50030990
Synonyms:
5-[3-(3-Fluoro-propoxy)-benzyl]-1-(2-hydroxy-ethoxymethyl)-1H-pyrimidine-2,4-dione | CHEMBL126468
Type:
Small organic molecule
Emp. Form.:
C17H21FN2O5
Mol. Mass.:
352.3574
SMILES:
OCCOCn1cc(Cc2cccc(OCCCF)c2)c(=O)[nH]c1=O
: