Target
Uridine phosphorylase 1
Ligand
BDBM50030992
Substrate
Meas. Tech.
ChEMBL_212951 (CHEMBL873996)
IC50
2000±n/a nM
Citation
 Orr, GFMusso, DLBoswell, GEKelley, JLJoyner, SSDavis, STBaccanari, DP Inhibition of uridine phosphorylase: synthesis and structure-activity relationships of aryl-substituted 5-benzyluracils and 1-[(2-hydroxyethoxy)methyl]-5-benzyluracils. J Med Chem 38:3850-6 (1995)  
Target
Name:
Uridine phosphorylase 1
Synonyms:
UPP1_MOUSE Upp | Upp1
Type:
PROTEIN
Mol. Mass.:
34086.29
Organism:
Mus musculus
Description:
ChEMBL_212951
Residue:
311
  
Inhibitor
Name:
BDBM50030992
Synonyms:
5-(3-Isopropoxy-benzyl)-1H-pyrimidine-2,4-dione | CHEMBL127209
Type:
Small organic molecule
Emp. Form.:
C14H16N2O3
Mol. Mass.:
260.2884
SMILES:
CC(C)Oc1cccc(Cc2c[nH]c(=O)[nH]c2=O)c1
: