Target
Uridine phosphorylase 1
Ligand
BDBM50030998
Substrate
Meas. Tech.
ChEMBL_212951 (CHEMBL873996)
IC50
5700±n/a nM
Citation
 Orr, GFMusso, DLBoswell, GEKelley, JLJoyner, SSDavis, STBaccanari, DP Inhibition of uridine phosphorylase: synthesis and structure-activity relationships of aryl-substituted 5-benzyluracils and 1-[(2-hydroxyethoxy)methyl]-5-benzyluracils. J Med Chem 38:3850-6 (1995)  
Target
Name:
Uridine phosphorylase 1
Synonyms:
UPP1_MOUSE Upp | Upp1
Type:
PROTEIN
Mol. Mass.:
34086.29
Organism:
Mus musculus
Description:
ChEMBL_212951
Residue:
311
  
Inhibitor
Name:
BDBM50030998
Synonyms:
5-Benzyl-1H-pyrimidine-2,4-dione | CHEMBL275965
Type:
Small organic molecule
Emp. Form.:
C11H10N2O2
Mol. Mass.:
202.2093
SMILES:
O=c1[nH]cc(Cc2ccccc2)c(=O)[nH]1
: