Target
Uridine phosphorylase 1
Ligand
BDBM50031003
Substrate
Meas. Tech.
ChEMBL_212951 (CHEMBL873996)
IC50
21100±n/a nM
Citation
 Orr, GFMusso, DLBoswell, GEKelley, JLJoyner, SSDavis, STBaccanari, DP Inhibition of uridine phosphorylase: synthesis and structure-activity relationships of aryl-substituted 5-benzyluracils and 1-[(2-hydroxyethoxy)methyl]-5-benzyluracils. J Med Chem 38:3850-6 (1995)  
Target
Name:
Uridine phosphorylase 1
Synonyms:
UPP1_MOUSE Upp | Upp1
Type:
PROTEIN
Mol. Mass.:
34086.29
Organism:
Mus musculus
Description:
ChEMBL_212951
Residue:
311
  
Inhibitor
Name:
BDBM50031003
Synonyms:
4-(2,4-Dioxo-1,2,3,4-tetrahydro-pyrimidin-5-ylmethyl)-benzonitrile | CHEMBL124860
Type:
Small organic molecule
Emp. Form.:
C12H9N3O2
Mol. Mass.:
227.2188
SMILES:
O=c1[nH]cc(Cc2ccc(cc2)C#N)c(=O)[nH]1
: