Target
Uridine phosphorylase 1
Ligand
BDBM50031010
Substrate
Meas. Tech.
ChEMBL_212952 (CHEMBL816766)
IC50
1860±n/a nM
Citation
 Orr, GFMusso, DLBoswell, GEKelley, JLJoyner, SSDavis, STBaccanari, DP Inhibition of uridine phosphorylase: synthesis and structure-activity relationships of aryl-substituted 5-benzyluracils and 1-[(2-hydroxyethoxy)methyl]-5-benzyluracils. J Med Chem 38:3850-6 (1995)  
Target
Name:
Uridine phosphorylase 1
Synonyms:
UPP1_MOUSE Upp | Upp1
Type:
PROTEIN
Mol. Mass.:
34086.29
Organism:
Mus musculus
Description:
ChEMBL_212951
Residue:
311
  
Inhibitor
Name:
BDBM50031010
Synonyms:
1-(2-Hydroxy-ethoxymethyl)-5-(3-methoxy-benzyl)-1H-pyrimidine-2,4-dione | CHEMBL123683
Type:
Small organic molecule
Emp. Form.:
C15H18N2O5
Mol. Mass.:
306.3138
SMILES:
COc1cccc(Cc2cn(COCCO)c(=O)[nH]c2=O)c1
: