Target
Cholesteryl ester transfer protein
Ligand
BDBM50128151
Substrate
Meas. Tech.
ChEMBL_911945 (CHEMBL3056385)
IC50
700003±n/a nM
Citation
  TBA Med Chem Res 13:590-604 (2004)    Article 
Target
Name:
Cholesteryl ester transfer protein
Synonyms:
CETP Cholesteryl ester transfer protein (CETP) | Lipid transfer protein I
Type:
Enzyme
Mol. Mass.:
54751.53
Organism:
Homo sapiens (Human)
Description:
P11597
Residue:
493
  
Inhibitor
Name:
BDBM50128151
Synonyms:
3-((3-(1,1,2,2-tetrafluoroethoxy)benzyl)(3-(4-aminophenoxy)phenyl)amino)-1,1,1-trifluoropropan-2-ol 3-{[3-(4-Amino-phenoxy)-phenyl]-[3-(1,1,2,2-tetrafluoro-ethoxy)-benzyl]-amino}-1,1,1-trifluoro-propan-2-ol | CHEMBL69170
Type:
Small organic molecule
Emp. Form.:
C24H21F7N2O3
Mol. Mass.:
518.424
SMILES:
Nc1ccc(Oc2cccc(c2)N(CC(O)C(F)(F)F)Cc2cccc(OC(F)(F)C(F)F)c2)cc1
: