Target
Cholinesterase
Ligand
BDBM81461
Substrate
Meas. Tech.
ChEMBL_909635 (CHEMBL3053711)
Ki
1900±n/a nM
Citation
  TBA Med Chem Res 14:297-308 (2005)    Article 
Target
Name:
Cholinesterase
Synonyms:
BCHE CHLE_HORSE | Cholinesterase
Type:
Enzyme
Mol. Mass.:
65643.35
Organism:
Equus caballus (Horse)
Description:
P81908
Residue:
574
  
Inhibitor
Name:
BDBM81461
Synonyms:
CAS_86-54-4 Hydralazine (HZN) | NSC_3637
Type:
Small organic molecule
Emp. Form.:
C8H8N4
Mol. Mass.:
160.1759
SMILES:
NNc1nncc2ccccc12
: