Target
Beta-1 adrenergic receptor
Ligand
BDBM50156257
Substrate
Meas. Tech.
ChEMBL_909576 (CHEMBL3059446)
EC50
19±n/a nM
Citation
 Senthil Kumar, PBharatam, PV Comparative 3D QSAR study on ?(1)-, ?(2)-, and ?(3)-adrenoceptor agonists. Med Chem Res 19:1121-1140 (2010)  
Target
Name:
Beta-1 adrenergic receptor
Synonyms:
ADRB1 ADRB1_HUMAN Beta-1 adrenoceptor adrenergic Beta1
Type:
G Protein-Coupled Receptor (GPCR)
Mol. Mass.:
51338.40
Organism:
Homo sapiens (Human)
Description:
P08588
Residue:
477
  
Inhibitor
Name:
BDBM50156257
Synonyms:
CHEMBL188196 | [3-(2-{(R)-(R)-2-Hydroxy-2-[3-(thiophene-2-sulfonylamino)-phenyl]-ethylamino}-propyl)-1H-indol-7-yloxy]-acetic acid
Type:
Small organic molecule
Emp. Form.:
C25H27N3O6S2
Mol. Mass.:
529.628
SMILES:
C[C@H](Cc1c[nH]c2c(OCC(O)=O)cccc12)NC[C@H](O)c1cccc(NS(=O)(=O)c2cccs2)c1
: