Target
Peroxisome proliferator-activated receptor gamma
Ligand
BDBM50127933
Substrate
Meas. Tech.
ChEMBL_912979 (CHEMBL3057028)
EC50
60±n/a nM
Citation
  TBA Med Chem Res 20:1005-1014 (2011)    Article 
Target
Name:
Peroxisome proliferator-activated receptor gamma
Synonyms:
NR1C3 PPAR-gamma PPARG_HUMAN Peroxisome proliferator-activated receptor gamma (PPAR gamma) Peroxisome proliferator-activated receptor gamma (PPARĪ³) peroxisome proliferator-activated receptor gamma isoform 2
Type:
Nuclear Receptor
Mol. Mass.:
57613.46
Organism:
Homo sapiens (Human)
Description:
P37231
Residue:
505
  
Inhibitor
Name:
BDBM50127933
Synonyms:
5-(4-(3-(4-(4-fluorophenoxy)-2-propylphenoxy)propoxy)phenyl)thiazolidine-2,4-dione CHEMBL1783044 | CHEMBL300026
Type:
Small organic molecule
Emp. Form.:
C27H26FNO5S
Mol. Mass.:
495.562
SMILES:
CCCc1cc(Oc2ccc(F)cc2)ccc1OCCCOc1ccc(cc1)-c1sc(=O)[nH]c1O
: