Target
Dipeptidyl peptidase 3
Ligand
BDBM25756
Substrate
Meas. Tech.
ChEMBL_913308 (CHEMBL3053565)
IC50
315000±n/a nM
Citation
 Dhanda, SSingh, JSingh, H Goat brain enkephalin degrading enzyme: interaction with analgesic and antihypertensive drugs Med Chem Res 20:1294-7 (2011)    Article 
Target
Name:
Dipeptidyl peptidase 3
Synonyms:
3.4.14.4 Dipeptidyl peptidase 3 M91_14005
Type:
PROTEIN
Mol. Mass.:
82027.05
Organism:
Bos mutus
Description:
ChEMBL_117383
Residue:
730
  
Inhibitor
Name:
BDBM25756
Synonyms:
(2R,3R)-2,3-dihydroxysuccinic acid;1-(isopropylamino)-3-[4-(2-methoxyethyl)phenoxy]propan-2-ol CHEMBL13 Spesicor metoprolol tartrate | {2-hydroxy-3-[4-(2-methoxyethyl)phenoxy]propyl}(propan-2-yl)amine
Type:
Small organic molecule
Emp. Form.:
C15H25NO3
Mol. Mass.:
267.3639
SMILES:
COCCc1ccc(OCC(O)CNC(C)C)cc1
: