Target
Trehalase
Ligand
BDBM50487997
Substrate
Meas. Tech.
ChEMBL_916861 (CHEMBL3082109)
IC50
239880±n/a nM
Citation
 Qian, XLiu, ZLi, ZLi, ZSong, G Synthesis and quantitative structure-activity relationships of fluorine-containing 4,4-dihydroxylmethyl-2-aryliminooxazo(thiazo)lidines as trehalase inhibitors. J Agric Food Chem 49:5279-84 (2001)  
Target
Name:
Trehalase
Synonyms:
Alpha-trehalose glucohydrolase | TREH
Type:
PROTEIN
Mol. Mass.:
66445.51
Organism:
Sus scrofa
Description:
ChEMBL_105438
Residue:
583
  
Inhibitor
Name:
BDBM50487997
Synonyms:
CHEMBL2270889
Type:
Small organic molecule
Emp. Form.:
C11H12ClFN2O2S
Mol. Mass.:
290.742
SMILES:
OCC1(CO)CS\C(N1)=N/c1ccc(F)c(Cl)c1
: