Target
Liver carboxylesterase
Ligand
BDBM50371971
Substrate
Meas. Tech.
ChEMBL_916865 (CHEMBL3082113)
IC50
54±n/a nM
Citation
 Wheelock, CESeverson, TFHammock, BD Synthesis of new carboxylesterase inhibitors and evaluation of potency and water solubility. Chem Res Toxicol 14:1563-72 (2001)  
Target
Name:
Liver carboxylesterase
Synonyms:
Carboxylesterase | EST1_PIG
Type:
PROTEIN
Mol. Mass.:
62009.98
Organism:
Sus scrofa
Description:
ChEMBL_427761
Residue:
566
  
Inhibitor
Name:
BDBM50371971
Synonyms:
CHEMBL440542
Type:
Small organic molecule
Emp. Form.:
C9H15F3OS
Mol. Mass.:
228.275
SMILES:
CCCCCCSCC(=O)C(F)(F)F
: