Target
Squalene monooxygenase
Ligand
BDBM50032843
Substrate
Meas. Tech.
ChEMBL_201941 (CHEMBL809128)
IC50
30±n/a nM
Citation
 Gotteland, JPBrunel, IGendre, FDésiré, JDelhon, AJunquéro, DOms, PHalazy, S (Aryloxy)methylsilane derivatives as new cholesterol biosynthesis inhibitors: synthesis and hypocholesterolemic activity of a new class of squalene epoxidase inhibitors. J Med Chem 38:3207-16 (1995)  
Target
Name:
Squalene monooxygenase
Synonyms:
ERG1 SE Squalene epoxidase
Type:
PROTEIN
Mol. Mass.:
63936.94
Organism:
Homo sapiens (Human)
Description:
ChEMBL_201924
Residue:
574
  
Inhibitor
Name:
BDBM50032843
Synonyms:
((E)-6,6-Dimethyl-hept-2-en-4-ynyl)-{3-[(dimethyl-o-tolyl-silanyl)-methoxy]-benzyl}-ethyl-amine | CHEMBL108692
Type:
Small organic molecule
Emp. Form.:
C28H39NOSi
Mol. Mass.:
433.7009
SMILES:
CCN(C\C=C\C#CC(C)(C)C)Cc1cccc(OC[Si](C)(C)c2ccccc2C)c1
: