Target
Gamma-aminobutyric acid type B receptor subunit 1
Ligand
BDBM50033017
Substrate
Meas. Tech.
ChEMBL_68561 (CHEMBL679648)
IC50
4000±n/a nM
Citation
 Froestl, WMickel, SJvon Sprecher, GDiel, PJHall, RGMaier, LStrub, DMelillo, VBaumann, PABernasconi, R Phosphinic acid analogues of GABA. 2. Selective, orally active GABAB antagonists. J Med Chem 38:3313-31 (1995)  
Target
Name:
Gamma-aminobutyric acid type B receptor subunit 1
Synonyms:
GABA B GABA uptake GABA-B-R1 GABABR1 Gabbr1 | Gb1
Type:
Enzyme Catalytic Domain
Mol. Mass.:
111548.69
Organism:
Rattus norvegicus (Rat)
Description:
Q9Z0U4
Residue:
991
  
Inhibitor
Name:
BDBM50033017
Synonyms:
(3-Amino-propyl)-cyclohexylmethyl-phosphinic acid | CHEMBL112362
Type:
Small organic molecule
Emp. Form.:
C10H22NO2P
Mol. Mass.:
219.2609
SMILES:
[#7]-[#6]-[#6]-[#6]P([#8])([#8])\[#6]=[#6]-1/[#6]-[#6]-[#6]-[#6]-[#6]-1
: