Target
C-C chemokine receptor type 5
Ligand
BDBM50104238
Substrate
Meas. Tech.
ChEMBL_922785 (CHEMBL3076029)
IC50
1.5±n/a nM
Citation
  TBA Med Chem Res 22:1399-1414 (2013)    Article 
Target
Name:
C-C chemokine receptor type 5
Synonyms:
C-C CKR-5 CC-CKR-5 CCR5 CCR5_HUMAN CHEMR13 HIV-1 fusion coreceptor
Type:
Enzyme
Mol. Mass.:
40540.21
Organism:
Homo sapiens (Human)
Description:
P51681
Residue:
352
  
Inhibitor
Name:
BDBM50104238
Synonyms:
CHEMBL421342 | {1-[(S)-4-(Benzenesulfonyl-methyl-amino)-3-phenyl-butyl]-piperidin-4-yl}-propyl-carbamic acid 4-nitro-benzyl ester
Type:
Small organic molecule
Emp. Form.:
C33H42N4O6S
Mol. Mass.:
622.775
SMILES:
CCCN(C1CCN(CC[C@H](CN(C)S(=O)(=O)c2ccccc2)c2ccccc2)CC1)C(=O)OCc1ccc(cc1)[N+]([O-])=O
: