Target
Protoporphyrinogen oxidase, chloroplastic
Ligand
BDBM50488398
Substrate
Meas. Tech.
ChEMBL_924308 (CHEMBL3081412)
Ki
200±n/a nM
Citation
 Zuo, YYang, SGLuo, YPTan, YHao, GFWu, QYXi, ZYang, GF Design and synthesis of 1-(benzothiazol-5-yl)-1H-1,2,4-triazol-5-ones as protoporphyrinogen oxidase inhibitors. Bioorg Med Chem 21:3245-55 (2013)  
Target
Name:
Protoporphyrinogen oxidase, chloroplastic
Synonyms:
1.3.3.4 PPO I PPX I Protoporphyrinogen IX oxidase isozyme I | Protoporphyrinogen oxidase, chloroplastic
Type:
PROTEIN
Mol. Mass.:
59244.44
Organism:
Nicotiana tabacum
Description:
ChEMBL_106599
Residue:
548
  
Inhibitor
Name:
BDBM50488398
Synonyms:
CHEMBL2286231
Type:
Small organic molecule
Emp. Form.:
C14H11F3N4OS2
Mol. Mass.:
372.389
SMILES:
Cc1nn(-c2cc3nc(SCC=C)sc3cc2F)c(=O)n1C(F)F
: