Target
Protoporphyrinogen oxidase, chloroplastic
Ligand
BDBM50488401
Substrate
Meas. Tech.
ChEMBL_924308 (CHEMBL3081412)
Ki
60±n/a nM
Citation
 Zuo, YYang, SGLuo, YPTan, YHao, GFWu, QYXi, ZYang, GF Design and synthesis of 1-(benzothiazol-5-yl)-1H-1,2,4-triazol-5-ones as protoporphyrinogen oxidase inhibitors. Bioorg Med Chem 21:3245-55 (2013)  
Target
Name:
Protoporphyrinogen oxidase, chloroplastic
Synonyms:
1.3.3.4 PPO I PPX I Protoporphyrinogen IX oxidase isozyme I | Protoporphyrinogen oxidase, chloroplastic
Type:
PROTEIN
Mol. Mass.:
59244.44
Organism:
Nicotiana tabacum
Description:
ChEMBL_106599
Residue:
548
  
Inhibitor
Name:
BDBM50488401
Synonyms:
CHEMBL2286233
Type:
Small organic molecule
Emp. Form.:
C15H13F3N4O3S2
Mol. Mass.:
418.414
SMILES:
CCOC(=O)CSc1nc2cc(c(F)cc2s1)-n1nc(C)n(C(F)F)c1=O
: