Target
Ecdysone receptor
Ligand
BDBM50488442
Substrate
Meas. Tech.
ChEMBL_923773 (CHEMBL3070751)
EC50
115±n/a nM
Citation
 Soin, TDe Geyter, EMosallanejad, HIga, MMartín, DOzaki, SKitsuda, SHarada, TMiyagawa, HStefanou, DKotzia, GEfrose, RLabropoulou, VGeelen, DIatrou, KNakagawa, YJanssen, CRSmagghe, GSwevers, L Assessment of species specificity of moulting accelerating compounds in Lepidoptera: comparison of activity between Bombyx mori and Spodoptera littoralis by in vitro reporter and in vivo toxicity assays. Pest Manag Sci 66:526-35 (2010)  
Target
Name:
Ecdysone receptor
Synonyms:
20-hydroxy-ecdysone receptor ECR_BOMMO EcRH NR1H1 | Nuclear receptor subfamily 1 group H member 1
Type:
PROTEIN
Mol. Mass.:
68199.29
Organism:
Bombyx mori
Description:
ChEMBL_65456
Residue:
606
  
Inhibitor
Name:
BDBM50488442
Synonyms:
CHEMBL2286438
Type:
Small organic molecule
Emp. Form.:
C22H27ClN2O2
Mol. Mass.:
386.915
SMILES:
CCc1ccc(cc1)C(=O)NN(C(=O)c1cc(C)cc(C)c1Cl)C(C)(C)C
: