Target
Ecdysone receptor
Ligand
BDBM50128305
Substrate
Meas. Tech.
ChEMBL_923773 (CHEMBL3070751)
EC50
3.4±n/a nM
Citation
 Soin, TDe Geyter, EMosallanejad, HIga, MMartín, DOzaki, SKitsuda, SHarada, TMiyagawa, HStefanou, DKotzia, GEfrose, RLabropoulou, VGeelen, DIatrou, KNakagawa, YJanssen, CRSmagghe, GSwevers, L Assessment of species specificity of moulting accelerating compounds in Lepidoptera: comparison of activity between Bombyx mori and Spodoptera littoralis by in vitro reporter and in vivo toxicity assays. Pest Manag Sci 66:526-35 (2010)  
Target
Name:
Ecdysone receptor
Synonyms:
20-hydroxy-ecdysone receptor ECR_BOMMO EcRH NR1H1 | Nuclear receptor subfamily 1 group H member 1
Type:
PROTEIN
Mol. Mass.:
68199.29
Organism:
Bombyx mori
Description:
ChEMBL_65456
Residue:
606
  
Inhibitor
Name:
BDBM50128305
Synonyms:
3-methoxy-2-methylbenzoic acid 2-(3,5-dimethylbenzoyl)-2-(1,1-dimethylethyl)hydrazide N'-(tert-butyl)-N'-(3,5-dimethylbenzoyl)-3-methoxy-2-methylbenzohydrazide N-tert-butyl-N'-(3-methoxy-o-toluoyl)-3,5-xylohydrazide | methoxyfenozide
Type:
Small organic molecule
Emp. Form.:
C22H28N2O3
Mol. Mass.:
368.4693
SMILES:
COc1cccc(C(=O)NN(C(=O)c2cc(C)cc(C)c2)C(C)(C)C)c1C
: