Target
Ecdysone receptor
Ligand
BDBM50178985
Substrate
Meas. Tech.
ChEMBL_925676 (CHEMBL3070722)
EC50
66±n/a nM
Citation
 Soin, TSwevers, LKotzia, GIatrou, KJanssen, CRRougé, PHarada, TNakagawa, YSmagghe, G Comparison of the activity of non-steroidal ecdysone agonists between dipteran and lepidopteran insects, using cell-based EcR reporter assays. Pest Manag Sci 66:1215-29 (2010)  
Target
Name:
Ecdysone receptor
Synonyms:
20-hydroxy-ecdysone receptor ECR_BOMMO EcRH NR1H1 | Nuclear receptor subfamily 1 group H member 1
Type:
PROTEIN
Mol. Mass.:
68199.29
Organism:
Bombyx mori
Description:
ChEMBL_65456
Residue:
606
  
Inhibitor
Name:
BDBM50178985
Synonyms:
CHEMBL2286727
Type:
Small organic molecule
Emp. Form.:
C21H26N2O3
Mol. Mass.:
354.4427
SMILES:
COc1cccc(c1)C(=O)NN(C(=O)c1cc(C)cc(C)c1)C(C)(C)C
: