Target
Ecdysone receptor
Ligand
BDBM50488532
Substrate
Meas. Tech.
ChEMBL_925676 (CHEMBL3070722)
EC50
52±n/a nM
Citation
 Soin, TSwevers, LKotzia, GIatrou, KJanssen, CRRougé, PHarada, TNakagawa, YSmagghe, G Comparison of the activity of non-steroidal ecdysone agonists between dipteran and lepidopteran insects, using cell-based EcR reporter assays. Pest Manag Sci 66:1215-29 (2010)  
Target
Name:
Ecdysone receptor
Synonyms:
20-hydroxy-ecdysone receptor ECR_BOMMO EcRH NR1H1 | Nuclear receptor subfamily 1 group H member 1
Type:
PROTEIN
Mol. Mass.:
68199.29
Organism:
Bombyx mori
Description:
ChEMBL_65456
Residue:
606
  
Inhibitor
Name:
BDBM50488532
Synonyms:
CHEMBL2286750
Type:
Small organic molecule
Emp. Form.:
C19H21ClN2O3
Mol. Mass.:
360.835
SMILES:
COc1cccc(c1)C(=O)NN(C(=O)c1ccccc1Cl)C(C)(C)C
: