Target
Peroxisome proliferator-activated receptor delta
Ligand
BDBM50269531
Substrate
Meas. Tech.
ChEMBL_933249 (CHEMBL3069173)
IC50
9600±n/a nM
Citation
  TBA Med Chem Res 22:3126-3133 (2013)    Article 
Target
Name:
Peroxisome proliferator-activated receptor delta
Synonyms:
NR1C2 NUCI Nuclear receptor subfamily 1 group C member 2 PPAR-beta PPARD Peroxisome proliferator-activated receptor Peroxisome proliferator-activated receptor delta
Type:
Enzyme
Mol. Mass.:
49910.45
Organism:
Homo sapiens (Human)
Description:
Q03181
Residue:
441
  
Inhibitor
Name:
BDBM50269531
Synonyms:
(9Z)-hexadec-9-enoic acid (Z)-hexadec-9-enoic acid 9-cis-hexadecenoic acid Palmitoleic acid (PoA) palmitoleic acid zoomaric acid
Type:
Small organic molecule
Emp. Form.:
C16H30O2
Mol. Mass.:
254.4082
SMILES:
CCCCCC\C=C/CCCCCCCC(O)=O
: