Target
Neutrophil elastase
Ligand
BDBM50034672
Substrate
Meas. Tech.
ChEMBL_63998 (CHEMBL673107)
Ki
20.5±n/a nM
Citation
 Desai, RCCourt, JCFerguson, EGordon, RJHlasta, DJDunlap, RPFranke, CA Phosphonates and phosphinates: novel leaving groups for benzisothiazolone inhibitors of human leukocyte elastase. J Med Chem 38:1571-4 (1995)  
Target
Name:
Neutrophil elastase
Synonyms:
Bone marrow serine protease Coagulation factor X ELANE Elastase HLE Leukocyte elastase Medullasin Neutrophil elastase (HNE) PMN elastase Trypsin
Type:
Enzyme
Mol. Mass.:
28532.38
Organism:
Homo sapiens (Human)
Description:
P08246
Residue:
267
  
Inhibitor
Name:
BDBM50034672
Synonyms:
CHEMBL290748 | Phosphoric acid dibenzyl ester 1,1,3-trioxo-1,3-dihydro-1lambda*6*-benzo[d]isothiazol-2-ylmethyl ester
Type:
Small organic molecule
Emp. Form.:
C22H20NO7PS
Mol. Mass.:
473.435
SMILES:
O=C1N(COP(=O)(OCc2ccccc2)OCc2ccccc2)S(=O)(=O)c2ccccc12
: