Target
Muscarinic acetylcholine receptor M4
Ligand
BDBM50035277
Substrate
Meas. Tech.
ChEMBL_139107 (CHEMBL749231)
EC50
30±n/a nM
Citation
 Bräuner-Osborne, HEbert, BBrann, MRFalch, EKrogsgaard-Larsen, P Annulated heterocyclic bioisosteres of norarecoline. Synthesis and molecular pharmacology at five recombinant human muscarinic acetylcholine receptors. J Med Chem 38:2188-95 (1995)  
Target
Name:
Muscarinic acetylcholine receptor M4
Synonyms:
ACM4_HUMAN Cholinergic, muscarinic M4 Muscarinic acetylcholine receptor M2 and M4
Type:
Enzyme Catalytic Domain
Mol. Mass.:
53079.31
Organism:
Homo sapiens (Human)
Description:
Cholinergic, muscarinic M4 CHRM4 HUMAN M3::P08173
Residue:
479
  
Inhibitor
Name:
BDBM50035277
Synonyms:
3-Prop-2-ynyloxy-5,6,7,8-tetrahydro-4H-isoxazolo[4,5-c]azepine | CHEMBL69306
Type:
Small organic molecule
Emp. Form.:
C10H12N2O2
Mol. Mass.:
192.2145
SMILES:
C#CCOc1noc2CCCNCc12
: