Target
5-hydroxytryptamine receptor 1A
Ligand
BDBM50035308
Substrate
Meas. Tech.
ChEMBL_1471 (CHEMBL616594)
Ki
14±n/a nM
Citation
 Stjernlöf, PEnnis, MDHansson, LOHoffman, RLGhazal, NBSundell, SSmith, MWSvensson, KCarlsson, AWikström, H Structure-activity relationships in the 8-amino-6,7,8,9-tetrahydro-3H-benz[e]indole ring system. 1. Effects of substituents in the aromatic system on serotonin and dopamine receptor subtypes. J Med Chem 38:2202-16 (1995)  
Target
Name:
5-hydroxytryptamine receptor 1A
Synonyms:
5-HT-1A 5-HT1A 5-hydroxytryptamine receptor 1A (5HT1A) 5ht1a Htr1a Serotonin 1a (5-HT1a) receptor/Adrenergic receptor alpha-1 | Serotonin receptor 1A
Type:
G Protein-Coupled Receptor (GPCR)
Mol. Mass.:
46445.29
Organism:
Rattus norvegicus (rat)
Description:
Binding assays were performed using rat hippocampal membranes.
Residue:
422
  
Inhibitor
Name:
BDBM50035308
Synonyms:
8-Dipropylamino-1,3,6,7,8,9-hexahydro-benzo[e]indol-2-one | CHEMBL71091
Type:
Small organic molecule
Emp. Form.:
C18H26N2O
Mol. Mass.:
286.4118
SMILES:
CCCN(CCC)C1CCc2ccc3NC(=O)Cc3c2C1
: