Target
5-hydroxytryptamine receptor 1A
Ligand
BDBM50035322
Substrate
Meas. Tech.
ChEMBL_1471 (CHEMBL616594)
Ki
7.3±n/a nM
Citation
 Stjernlöf, PEnnis, MDHansson, LOHoffman, RLGhazal, NBSundell, SSmith, MWSvensson, KCarlsson, AWikström, H Structure-activity relationships in the 8-amino-6,7,8,9-tetrahydro-3H-benz[e]indole ring system. 1. Effects of substituents in the aromatic system on serotonin and dopamine receptor subtypes. J Med Chem 38:2202-16 (1995)  
Target
Name:
5-hydroxytryptamine receptor 1A
Synonyms:
5-HT-1A 5-HT1A 5-hydroxytryptamine receptor 1A (5HT1A) 5ht1a Htr1a Serotonin 1a (5-HT1a) receptor/Adrenergic receptor alpha-1 | Serotonin receptor 1A
Type:
G Protein-Coupled Receptor (GPCR)
Mol. Mass.:
46445.29
Organism:
Rattus norvegicus (rat)
Description:
Binding assays were performed using rat hippocampal membranes.
Residue:
422
  
Inhibitor
Name:
BDBM50035322
Synonyms:
2-(8-Dipropylamino-6,7,8,9-tetrahydro-3H-benzo[e]indol-1-yl)-N,N-diethyl-2-oxo-acetamide | CHEMBL71139
Type:
Small organic molecule
Emp. Form.:
C24H35N3O2
Mol. Mass.:
397.5536
SMILES:
CCCN(CCC)C1CCc2ccc3[nH]cc(C(=O)C(=O)N(CC)CC)c3c2C1
: