Target
D(2) dopamine receptor
Ligand
BDBM50035306
Substrate
Meas. Tech.
ChEMBL_62564 (CHEMBL671495)
Ki
9.8±n/a nM
Citation
 Stjernlöf, PEnnis, MDHansson, LOHoffman, RLGhazal, NBSundell, SSmith, MWSvensson, KCarlsson, AWikström, H Structure-activity relationships in the 8-amino-6,7,8,9-tetrahydro-3H-benz[e]indole ring system. 1. Effects of substituents in the aromatic system on serotonin and dopamine receptor subtypes. J Med Chem 38:2202-16 (1995)  
Target
Name:
D(2) dopamine receptor
Synonyms:
DOPAMINE D2 DOPAMINE D2 Short Dopamine D2 receptor Drd2
Type:
G Protein-Coupled Receptor (GPCR)
Mol. Mass.:
50931.60
Organism:
Rattus norvegicus (rat)
Description:
P61169
Residue:
444
  
Inhibitor
Name:
BDBM50035306
Synonyms:
(1-Chloro-6,7,8,9-tetrahydro-3H-benzo[e]indol-8-yl)-dipropyl-amine | CHEMBL303021
Type:
Small organic molecule
Emp. Form.:
C18H25ClN2
Mol. Mass.:
304.858
SMILES:
CCCN(CCC)C1CCc2ccc3[nH]cc(Cl)c3c2C1
: