Target
D(3) dopamine receptor
Ligand
BDBM50035299
Substrate
Meas. Tech.
ChEMBL_62765 (CHEMBL676292)
Ki
4.1±n/a nM
Citation
 Stjernlöf, PEnnis, MDHansson, LOHoffman, RLGhazal, NBSundell, SSmith, MWSvensson, KCarlsson, AWikström, H Structure-activity relationships in the 8-amino-6,7,8,9-tetrahydro-3H-benz[e]indole ring system. 1. Effects of substituents in the aromatic system on serotonin and dopamine receptor subtypes. J Med Chem 38:2202-16 (1995)  
Target
Name:
D(3) dopamine receptor
Synonyms:
DOPAMINE D3 Dopamine D3 receptor | Drd3
Type:
Protein
Mol. Mass.:
49540.58
Organism:
Rattus norvegicus (Rat)
Description:
P19020
Residue:
446
  
Inhibitor
Name:
BDBM50035299
Synonyms:
((S)-4-Fluoro-6,7,8,9-tetrahydro-3H-benzo[e]indol-8-yl)-dipropyl-amine | CHEMBL304573
Type:
Small organic molecule
Emp. Form.:
C18H25FN2
Mol. Mass.:
288.4029
SMILES:
CCCN(CCC)[C@H]1CCc2cc(F)c3[nH]ccc3c2C1
: