Target
Protein kinase C alpha type
Ligand
BDBM50035466
Substrate
Meas. Tech.
ChEMBL_160433 (CHEMBL763603)
Ki
16100±n/a nM
Citation
 Wang, SZaharevitz, DWSharma, RMarquez, VELewin, NEDu, LBlumberg, PMMilne, GW The discovery of novel, structurally diverse protein kinase C agonists through computer 3D-database pharmacophore search. Molecular modeling studies. J Med Chem 37:4479-89 (1995)  
Target
Name:
Protein kinase C alpha type
Synonyms:
KPCA_HUMAN PKC alpha and beta-2 PKC-alpha PRKACA Protein Kinase C- alpha Protein kinase C alpha (PKCa) Protein kinase C alpha type (PRKCA) RAF proto-oncogene serine/threonine-protein kinase
Type:
Enzyme
Mol. Mass.:
76755.65
Organism:
Homo sapiens (Human)
Description:
The recombinant human PKC enzymes were produced using a baculovirus expression system in SF9 cells
Residue:
672
  
Inhibitor
Name:
BDBM50035466
Synonyms:
2-[1-[Bis-(2-hydroxy-ethyl)-amino]-meth-(Z)-ylidene]-17-hydroxy-10,13-dimethyl-hexadecahydro-cyclopenta[a]phenanthren-3-one | CHEMBL3085524
Type:
Small organic molecule
Emp. Form.:
C24H39NO4
Mol. Mass.:
405.5708
SMILES:
[H][C@@]12CC[C@H](O)[C@@]1(C)CC[C@@]1([H])[C@@]2([H])CC[C@@]2([H])CC(=O)\C(C[C@]12C)=C/N(CCO)CCO
: