Target
Protein kinase C alpha type
Ligand
BDBM50035468
Substrate
Meas. Tech.
ChEMBL_160433 (CHEMBL763603)
Ki
7800±n/a nM
Citation
 Wang, SZaharevitz, DWSharma, RMarquez, VELewin, NEDu, LBlumberg, PMMilne, GW The discovery of novel, structurally diverse protein kinase C agonists through computer 3D-database pharmacophore search. Molecular modeling studies. J Med Chem 37:4479-89 (1995)  
Target
Name:
Protein kinase C alpha type
Synonyms:
KPCA_HUMAN PKC alpha and beta-2 PKC-alpha PRKACA Protein Kinase C- alpha Protein kinase C alpha (PKCa) Protein kinase C alpha type (PRKCA) RAF proto-oncogene serine/threonine-protein kinase
Type:
Enzyme
Mol. Mass.:
76755.65
Organism:
Homo sapiens (Human)
Description:
The recombinant human PKC enzymes were produced using a baculovirus expression system in SF9 cells
Residue:
672
  
Inhibitor
Name:
BDBM50035468
Synonyms:
4-(4-Hydroxy-9,10-dioxo-9,10-dihydro-anthracen-1-ylamino)-N,N-bis-(2-hydroxy-ethyl)-benzenesulfonamide NSC-115290
Type:
Small organic molecule
Emp. Form.:
C24H22N2O7S
Mol. Mass.:
482.506
SMILES:
OCCN(CCO)S(=O)(=O)c1ccc(Nc2ccc(O)c3C(=O)c4ccccc4C(=O)c23)cc1
: