Target
Protein kinase C alpha type
Ligand
BDBM50035469
Substrate
Meas. Tech.
ChEMBL_160433 (CHEMBL763603)
Ki
12900±n/a nM
Citation
 Wang, SZaharevitz, DWSharma, RMarquez, VELewin, NEDu, LBlumberg, PMMilne, GW The discovery of novel, structurally diverse protein kinase C agonists through computer 3D-database pharmacophore search. Molecular modeling studies. J Med Chem 37:4479-89 (1995)  
Target
Name:
Protein kinase C alpha type
Synonyms:
KPCA_HUMAN PKC alpha and beta-2 PKC-alpha PRKACA Protein Kinase C- alpha Protein kinase C alpha (PKCa) Protein kinase C alpha type (PRKCA) RAF proto-oncogene serine/threonine-protein kinase
Type:
Enzyme
Mol. Mass.:
76755.65
Organism:
Homo sapiens (Human)
Description:
The recombinant human PKC enzymes were produced using a baculovirus expression system in SF9 cells
Residue:
672
  
Inhibitor
Name:
BDBM50035469
Synonyms:
2-hydroxy-1-(2-hydroxy-1-phenylcarbonyloxyethyl)-3-phenylcarbonyloxypropyl benzoate | CHEMBL138868
Type:
Small organic molecule
Emp. Form.:
C26H24O8
Mol. Mass.:
464.464
SMILES:
OCC(OC(=O)c1ccccc1)C(OC(=O)c1ccccc1)C(O)COC(=O)c1ccccc1
: