Target
UDP-3-O-acyl-N-acetylglucosamine deacetylase
Ligand
BDBM50491041
Substrate
Meas. Tech.
ChEMBL_957666 (CHEMBL2378594)
IC50
19±n/a nM
Citation
 Hale, MRHill, PLahiri, SMiller, MDRoss, PAlm, RGao, NKutschke, AJohnstone, MPrince, BThresher, JYang, W Exploring the UDP pocket of LpxC through amino acid analogs. Bioorg Med Chem Lett 23:2362-7 (2013)  
Target
Name:
UDP-3-O-acyl-N-acetylglucosamine deacetylase
Synonyms:
LPXC_ECOLI UDP-3-O-[3-hydroxymyristoyl] N-acetylglucosamine deacetylase (LxpC) asmB lpxC
Type:
Enzyme
Mol. Mass.:
33952.00
Organism:
Escherichia coli
Description:
P0A725
Residue:
305
  
Inhibitor
Name:
BDBM50491041
Synonyms:
CHEMBL2377696
Type:
Small organic molecule
Emp. Form.:
C18H16N2O3
Mol. Mass.:
308.3312
SMILES:
CC(NC(=O)c1ccc(cc1)C#Cc1ccccc1)C(=O)NO
: