Target
Peroxisome proliferator-activated receptor alpha
Ligand
BDBM50171898
Substrate
Meas. Tech.
ChEMBL_955714 (CHEMBL2379025)
EC50
501±n/a nM
Citation
 Carrieri, AGiudici, MParente, MDe Rosas, MPiemontese, LFracchiolla, GLaghezza, ATortorella, PCarbonara, GLavecchia, AGilardi, FCrestani, MLoiodice, F Molecular determinants for nuclear receptors selectivity: chemometric analysis, dockings and site-directed mutagenesis of dual peroxisome proliferator-activated receptors ?/? agonists. Eur J Med Chem 63:321-32 (2013)  
Target
Name:
Peroxisome proliferator-activated receptor alpha
Synonyms:
NR1C1 PPAR PPAR-alpha PPARA_HUMAN Peroxisome proliferator-activated receptor | Peroxisome proliferator-activated receptor alpha (PPAR alpha)
Type:
Enzyme
Mol. Mass.:
52222.08
Organism:
Homo sapiens (Human)
Description:
Q07869
Residue:
468
  
Inhibitor
Name:
BDBM50171898
Synonyms:
(S)-3-Phenyl-2-(4-trifluoromethyl-phenoxy)-propionic acid | CHEMBL192518
Type:
Small organic molecule
Emp. Form.:
C16H13F3O3
Mol. Mass.:
310.2678
SMILES:
OC(=O)[C@H](Cc1ccccc1)Oc1ccc(cc1)C(F)(F)F
: