Target
Prostaglandin G/H synthase 2
Ligand
BDBM50035694
Substrate
Meas. Tech.
ChEMBL_956924 (CHEMBL2378241)
IC50
400±n/a nM
Citation
 Al-Suwaidan, IAAlanazi, AMEl-Azab, ASAl-Obaid, AMElTahir, KEMaarouf, ARAbu El-Enin, MAAbdel-Aziz, AA Molecular design, synthesis and biological evaluation of cyclic imides bearing benzenesulfonamide fragment as potential COX-2 inhibitors. Part 2. Bioorg Med Chem Lett 23:2601-5 (2013)  
Target
Name:
Prostaglandin G/H synthase 2
Synonyms:
COX2 Cyclooxygenase-2 (COX-2) PTGS2 Prostaglandin G/H synthase (cyclooxygenase)
Type:
Protein
Mol. Mass.:
68976.98
Organism:
Ovis aries (Sheep)
Description:
Residue:
603
  
Inhibitor
Name:
BDBM50035694
Synonyms:
CHEMBL2377793
Type:
Small organic molecule
Emp. Form.:
C15H10Cl2N2O4S
Mol. Mass.:
385.222
SMILES:
NS(=O)(=O)c1ccc(CN2C(=O)c3cc(Cl)c(Cl)cc3C2=O)cc1
: