Target
Protein kinase C delta type
Ligand
BDBM50391388
Substrate
Meas. Tech.
ChEMBL_959552 (CHEMBL2384826)
Ki
22±n/a nM
Citation
 Kamachi, HTanaka, KYanagita, RCMurakami, AMurakami, KTokuda, HSuzuki, NNakagawa, YIrie, K Structure-activity studies on the side chain of a simplified analog of aplysiatoxin (aplog-1) with anti-proliferative activity. Bioorg Med Chem 21:2695-702 (2013)  
Target
Name:
Protein kinase C delta type
Synonyms:
KPCD_HUMAN PKCD Protein Kinase C- delta nPKC-delta
Type:
Enzyme
Mol. Mass.:
77516.79
Organism:
Homo sapiens (Human)
Description:
The recombinant human PKC enzymes were produced using a baculovirus expression system in SF9 cells
Residue:
676
  
Inhibitor
Name:
BDBM50391388
Synonyms:
CHEMBL2148108
Type:
Small organic molecule
Emp. Form.:
C28H40O8
Mol. Mass.:
504.6124
SMILES:
C[C@@H]1[C@@H](CCCCc2cccc(O)c2)O[C@]23C[C@@H]1OC(=O)C[C@H](CO)OC(=O)C[C@@H](CCC2(C)C)O3
: