Target
Thymidine kinase, cytosolic
Ligand
BDBM21868
Substrate
Meas. Tech.
ChEMBL_208011 (CHEMBL816091)
Ki
2060±n/a nM
Citation
 Xu, HMaga, GFocher, FSmith, ERSpadari, SGambino, JWright, GE Synthesis, properties, and pharmacokinetic studies of N2-phenylguanine derivatives as inhibitors of herpes simplex virus thymidine kinases. J Med Chem 38:49-57 (1995)  
Target
Name:
Thymidine kinase, cytosolic
Synonyms:
KITH_HUMAN | TK1
Type:
PROTEIN
Mol. Mass.:
25476.50
Organism:
Homo sapiens (Human)
Description:
ChEMBL_1333884
Residue:
234
  
Inhibitor
Name:
BDBM21868
Synonyms:
2-amino-9-(4-hydroxybutyl)-6,9-dihydro-3H-purin-6-one CHEMBL258513 | HBG
Type:
Small organic molecule
Emp. Form.:
C9H13N5O2
Mol. Mass.:
223.2318
SMILES:
Nc1nc2n(CCCCO)cnc2c(=O)[nH]1
: