Target
Proto-oncogene tyrosine-protein kinase Src
Ligand
BDBM50036015
Substrate
Meas. Tech.
ChEMBL_221790 (CHEMBL843184)
IC50
2600±n/a nM
Citation
 Palmer, BDRewcastle, GWThompson, AMBoyd, MShowalter, HDSercel, ADFry, DWKraker, AJDenny, WA Tyrosine kinase inhibitors. 4. Structure-activity relationships among N- and 3-substituted 2,2'-dithiobis(1H-indoles) for in vitro inhibition of receptor and nonreceptor protein tyrosine kinases. J Med Chem 38:58-67 (1995)  
Target
Name:
Proto-oncogene tyrosine-protein kinase Src
Synonyms:
Calmodulin/Proto-oncogene tyrosine-protein kinase Src Proto-oncogene c-Src SRC SRC_HUMAN V-src sarcoma (Schmidt-Ruppin A-2) viral oncogene homolog (avian) p60-Src | pp60c-src
Type:
Protein
Mol. Mass.:
59838.60
Organism:
Homo sapiens (Human)
Description:
P12931
Residue:
536
  
Inhibitor
Name:
BDBM50036015
Synonyms:
CHEMBL349322 | [2-(3-Benzoyl-1-methyl-1H-indol-2-yldisulfanyl)-1-methyl-1H-indol-3-yl]-phenyl-methanone
Type:
Small organic molecule
Emp. Form.:
C32H24N2O2S2
Mol. Mass.:
532.675
SMILES:
Cn1c(SSc2c(C(=O)c3ccccc3)c3ccccc3n2C)c(C(=O)c2ccccc2)c2ccccc12
: