Target
Epidermal growth factor receptor
Ligand
BDBM50036015
Substrate
Meas. Tech.
ChEMBL_65135 (CHEMBL677470)
IC50
>100000±n/a nM
Citation
 Palmer, BDRewcastle, GWThompson, AMBoyd, MShowalter, HDSercel, ADFry, DWKraker, AJDenny, WA Tyrosine kinase inhibitors. 4. Structure-activity relationships among N- and 3-substituted 2,2'-dithiobis(1H-indoles) for in vitro inhibition of receptor and nonreceptor protein tyrosine kinases. J Med Chem 38:58-67 (1995)  
Target
Name:
Epidermal growth factor receptor
Synonyms:
EGF Receptor Substrate EGFR_HUMAN ERBB1 Epidermal Growth Factor Receptor erbB-1 Epidermal growth factor receptor (EGFR) HER1 Proto-oncogene c-ErbB-1 Tyrosine-Protein Kinase ErbB-1
Type:
Receptor Kinase Domain
Mol. Mass.:
134279.59
Organism:
Homo sapiens (Human)
Description:
P00533
Residue:
1210
  
Inhibitor
Name:
BDBM50036015
Synonyms:
CHEMBL349322 | [2-(3-Benzoyl-1-methyl-1H-indol-2-yldisulfanyl)-1-methyl-1H-indol-3-yl]-phenyl-methanone
Type:
Small organic molecule
Emp. Form.:
C32H24N2O2S2
Mol. Mass.:
532.675
SMILES:
Cn1c(SSc2c(C(=O)c3ccccc3)c3ccccc3n2C)c(C(=O)c2ccccc2)c2ccccc12
: