Target
DNA topoisomerase 1
Ligand
BDBM50036131
Substrate
Meas. Tech.
ChEMBL_53717 (CHEMBL663645)
IC50
300±n/a nM
Citation
 Luzzio, MJBesterman, JMEmerson, DLEvans, MGLackey, KLeitner, PLMcIntyre, GMorton, BMyers, PLPeel, M Synthesis and antitumor activity of novel water soluble derivatives of camptothecin as specific inhibitors of topoisomerase I. J Med Chem 38:395-401 (1995)  
Target
Name:
DNA topoisomerase 1
Synonyms:
DNA topoisomerase I TOP1 | TOP1_HUMAN
Type:
Enzyme
Mol. Mass.:
90771.02
Organism:
Homo sapiens (Human)
Description:
P11387
Residue:
765
  
Inhibitor
Name:
BDBM50036131
Synonyms:
7-ethyl-7-hydroxy-14-(4-methylhexahydro-1-pyrazinylmethyl)-(7S)-7,8,11,13-tetrahydro-10H-[1,3]dioxolo[4,5-g]pyrano[3',4':6,7]indolizino[1,2-b]quinoline-8,11-dione with trifluoroaceticacid | CHEMBL128315
Type:
Small organic molecule
Emp. Form.:
C27H28N4O6
Mol. Mass.:
504.5344
SMILES:
CC[C@@]1(O)C(=O)OCc2c1cc1-c3nc4cc5OCOc5cc4c(CN4CCN(C)CC4)c3Cn1c2=O
: