Target
Muscarinic acetylcholine receptor M1
Ligand
BDBM50036166
Substrate
Meas. Tech.
ChEMBL_138134 (CHEMBL747393)
Ki
2200±n/a nM
Citation
 Nilsson, BMSundquist, SJohansson, GNordvall, GGlas, GNilvebrant, LHacksell, U 3-Heteroaryl-substituted quinuclidin-3-ol and quinuclidin-2-ene derivatives as muscarinic antagonists. Synthesis and structure-activity relationships. J Med Chem 38:473-87 (1995)  
Target
Name:
Muscarinic acetylcholine receptor M1
Synonyms:
ACM1_HUMAN Cholinergic receptor, muscarinic 1 | Cholinergic, muscarinic M1
Type:
Protein
Mol. Mass.:
51442.54
Organism:
Homo sapiens (Human)
Description:
P11229
Residue:
460
  
Inhibitor
Name:
BDBM50036166
Synonyms:
3-(pyridin-3-yl)-1-azabicyclo[2.2.2]oct-2-ene CHEMBL64779
Type:
Small organic molecule
Emp. Form.:
C12H14N2
Mol. Mass.:
186.253
SMILES:
C1CN2CCC1C(=C2)c1cccnc1
: