Target
Muscarinic acetylcholine receptor M2
Ligand
BDBM50036164
Substrate
Meas. Tech.
ChEMBL_139350 (CHEMBL752398)
Ki
9200±n/a nM
Citation
 Nilsson, BMSundquist, SJohansson, GNordvall, GGlas, GNilvebrant, LHacksell, U 3-Heteroaryl-substituted quinuclidin-3-ol and quinuclidin-2-ene derivatives as muscarinic antagonists. Synthesis and structure-activity relationships. J Med Chem 38:473-87 (1995)  
Target
Name:
Muscarinic acetylcholine receptor M2
Synonyms:
ACM2_HUMAN Cholinergic, muscarinic M2 Muscarinic acetylcholine receptor M2 and M5 | RecName: Full=Muscarinic acetylcholine receptor M2
Type:
GPCR
Mol. Mass.:
51730.61
Organism:
Homo sapiens (Human)
Description:
P08172
Residue:
466
  
Inhibitor
Name:
BDBM50036164
Synonyms:
3-Benzooxazol-2-yl-1-aza-bicyclo[2.2.2]octan-3-ol | CHEMBL145533
Type:
Small organic molecule
Emp. Form.:
C14H16N2O2
Mol. Mass.:
244.289
SMILES:
OC1(CN2CCC1CC2)c1nc2ccccc2o1
: