Target
Muscarinic acetylcholine receptor M1
Ligand
BDBM50036189
Substrate
Meas. Tech.
ChEMBL_138134 (CHEMBL747393)
Ki
2200±n/a nM
Citation
 Nilsson, BMSundquist, SJohansson, GNordvall, GGlas, GNilvebrant, LHacksell, U 3-Heteroaryl-substituted quinuclidin-3-ol and quinuclidin-2-ene derivatives as muscarinic antagonists. Synthesis and structure-activity relationships. J Med Chem 38:473-87 (1995)  
Target
Name:
Muscarinic acetylcholine receptor M1
Synonyms:
ACM1_HUMAN Cholinergic receptor, muscarinic 1 | Cholinergic, muscarinic M1
Type:
Protein
Mol. Mass.:
51442.54
Organism:
Homo sapiens (Human)
Description:
P11229
Residue:
460
  
Inhibitor
Name:
BDBM50036189
Synonyms:
3-(Tetrahydro-furan-2-yl)-1-aza-bicyclo[2.2.2]octane | CHEMBL343182
Type:
Small organic molecule
Emp. Form.:
C11H19NO
Mol. Mass.:
181.2747
SMILES:
C1COC(C1)C1CN2CCC1CC2
: