Target
Prostaglandin G/H synthase 1
Ligand
BDBM50491534
Substrate
Meas. Tech.
ChEMBL_958170 (CHEMBL2384262)
IC50
270±n/a nM
Citation
 Vitale, PTacconelli, SPerrone, MGMalerba, PSimone, LScilimati, ALavecchia, ADovizio, MMarcantoni, EBruno, APatrignani, P Synthesis, pharmacological characterization, and docking analysis of a novel family of diarylisoxazoles as highly selective cyclooxygenase-1 (COX-1) inhibitors. J Med Chem 56:4277-99 (2013)  
Target
Name:
Prostaglandin G/H synthase 1
Synonyms:
COX-1 Cyclooxygenase Cyclooxygenase-1 (COX-1) PTGS1 | Prostaglandin G/H synthase (cyclooxygenase)
Type:
Enzyme
Mol. Mass.:
68692.62
Organism:
Homo sapiens (Human)
Description:
P23219
Residue:
599
  
Inhibitor
Name:
BDBM50491534
Synonyms:
CHEMBL2380863
Type:
Small organic molecule
Emp. Form.:
C16H12ClNO
Mol. Mass.:
269.726
SMILES:
Cc1onc(c1-c1ccccc1)-c1ccccc1Cl
: