Target
Beta-secretase 1
Ligand
BDBM186053
Substrate
Meas. Tech.
ChEMBL_960999 (CHEMBL2388915)
IC50
35±n/a nM
Citation
 Rosse, G Dihydrooxazines As Inhibitors of BACE-1 or BACE-2. ACS Med Chem Lett 4:433-4 (2013)  
Target
Name:
Beta-secretase 1
Synonyms:
ASP2 Aspartyl protease 2 BACE1 Beta-secretase (BACE) Beta-secretase 1 (BACE 1) Beta-secretase 1 (BACE1) Beta-site amyloid precursor protein cleaving enzyme 1 Memapsin-2 beta-Secretase (BACE-1) | beta-Secretase (BACE1)
Type:
Protein
Mol. Mass.:
55755.10
Organism:
Homo sapiens (Human)
Description:
P56817
Residue:
501
  
Inhibitor
Name:
BDBM186053
Synonyms:
US9163011, 7
Type:
Small organic molecule
Emp. Form.:
C17H12ClF6N5O2
Mol. Mass.:
467.753
SMILES:
C[C@@]1(N=C(N)OCC1(F)F)c1nc(NC(=O)c2ncc(cc2Cl)C(F)(F)F)ccc1F
: