Target
Thromboxane-A synthase
Ligand
BDBM50036353
Substrate
Meas. Tech.
ChEMBL_210278 (CHEMBL808525)
IC50
36±n/a nM
Citation
 Faull, AWBrewster, AGBrown, GRSmithers, MJJackson, R Dual-acting thromboxane receptor antagonist/synthase inhibitors: synthesis and biological properties of [2-substituted-4-(3-pyridyl)-1,3-dioxan-5-yl] alkenoic acids. J Med Chem 38:686-94 (1995)  
Target
Name:
Thromboxane-A synthase
Synonyms:
CYP5 Cytochrome P450 5A1 TBXAS1 TXA synthase TXS Thromboxane A2 Synthase (P450 TxA2) Thromboxane prostanoid Thromboxane-A synthase
Type:
Enzyme
Mol. Mass.:
60524.67
Organism:
Homo sapiens (Human)
Description:
P24557
Residue:
533
  
Inhibitor
Name:
BDBM50036353
Synonyms:
(Z)-6-{2-[1-Methyl-1-(2-methylsulfanyl-phenoxy)-ethyl]-4-pyridin-3-yl-[1,3]dioxan-5-yl}-hex-4-enoic acid | CHEMBL352196
Type:
Small organic molecule
Emp. Form.:
C25H31NO5S
Mol. Mass.:
457.582
SMILES:
CSc1ccccc1OC(C)(C)C1OCC(C\C=C/CCC(O)=O)C(O1)c1cccnc1
: